Target
Cytosolic phospholipase A2
Ligand
BDBM50206337
Substrate
Meas. Tech.
ChEMBL_442619 (CHEMBL892787)
IC50
1100±n/a nM
Citation
 Hess, MSchulze Elfringhoff, ALehr, M 1-(5-Carboxy- and 5-carbamoylindol-1-yl)propan-2-ones as inhibitors of human cytosolic phospholipase A2alpha: bioisosteric replacement of the carboxylic acid and carboxamide moiety. Bioorg Med Chem 15:2883-91 (2007)  
Target
Name:
Cytosolic phospholipase A2
Synonyms:
CPLA2 PA24A_HUMAN PLA2G4A Phospholipase A2 | Phospholipase A2 group IVA
Type:
Protein
Mol. Mass.:
85219.30
Organism:
Homo sapiens (Human)
Description:
P47712
Residue:
749
  
Inhibitor
Name:
BDBM50206337
Synonyms:
1-(4-octylphenoxy)-3-[5-(1H-tetrazol-5-yl)indol-1-yl]propan-2-one | CHEMBL241892
Type:
Small organic molecule
Emp. Form.:
C26H31N5O2
Mol. Mass.:
445.5566
SMILES:
CCCCCCCCc1ccc(OCC(=O)Cn2ccc3cc(ccc23)-c2nnn[nH]2)cc1
: