Target
Cytosolic phospholipase A2
Ligand
BDBM50206338
Substrate
Meas. Tech.
ChEMBL_442619 (CHEMBL892787)
IC50
370±n/a nM
Citation
 Hess, MSchulze Elfringhoff, ALehr, M 1-(5-Carboxy- and 5-carbamoylindol-1-yl)propan-2-ones as inhibitors of human cytosolic phospholipase A2alpha: bioisosteric replacement of the carboxylic acid and carboxamide moiety. Bioorg Med Chem 15:2883-91 (2007)  
Target
Name:
Cytosolic phospholipase A2
Synonyms:
CPLA2 PA24A_HUMAN PLA2G4A Phospholipase A2 | Phospholipase A2 group IVA
Type:
Protein
Mol. Mass.:
85219.30
Organism:
Homo sapiens (Human)
Description:
P47712
Residue:
749
  
Inhibitor
Name:
BDBM50206338
Synonyms:
CHEMBL242960 | N-methyl-1-[3-(4-octylphenoxy)-2-oxopropyl]indole-5-carboxamide
Type:
Small organic molecule
Emp. Form.:
C27H34N2O3
Mol. Mass.:
434.5705
SMILES:
CCCCCCCCc1ccc(OCC(=O)Cn2ccc3cc(ccc23)C(=O)NC)cc1
: