Target
Cytosolic phospholipase A2
Ligand
BDBM50059523
Substrate
Meas. Tech.
ChEMBL_442619 (CHEMBL892787)
IC50
2300±n/a nM
Citation
 Hess, MSchulze Elfringhoff, ALehr, M 1-(5-Carboxy- and 5-carbamoylindol-1-yl)propan-2-ones as inhibitors of human cytosolic phospholipase A2alpha: bioisosteric replacement of the carboxylic acid and carboxamide moiety. Bioorg Med Chem 15:2883-91 (2007)  
Target
Name:
Cytosolic phospholipase A2
Synonyms:
CPLA2 PA24A_HUMAN PLA2G4A Phospholipase A2 | Phospholipase A2 group IVA
Type:
Protein
Mol. Mass.:
85219.30
Organism:
Homo sapiens (Human)
Description:
P47712
Residue:
749
  
Inhibitor
Name:
BDBM50059523
Synonyms:
(6Z,9Z,12Z,15Z)-1,1,1-trifluorohenicosa-6,9,12,15-tetraen-2-one Arachidonic acid trifluoromethyl ketone Arachidonyltrifluoromethane | CHEMBL281211
Type:
Small organic molecule
Emp. Form.:
C21H31F3O
Mol. Mass.:
356.4654
SMILES:
CCCCC\C=C/C\C=C/C\C=C/C\C=C/CCCC(=O)C(F)(F)F
: