Target
Aminopeptidase N
Ligand
BDBM50206547
Substrate
Meas. Tech.
ChEMBL_428663 (CHEMBL915810)
IC50
8580±n/a nM
Citation
 Flipo, MBeghyn, TLeroux, VFlorent, IDeprez, BPDeprez-Poulain, RF Novel selective inhibitors of the zinc plasmodial aminopeptidase PfA-M1 as potential antimalarial agents. J Med Chem 50:1322-34 (2007)  
Target
Name:
Aminopeptidase N
Synonyms:
AMPN_PIG AP-M Alanyl aminopeptidase Aminopeptidase N (APN) Microsomal aminopeptidase pAPN
Type:
Protein
Mol. Mass.:
108810.25
Organism:
Sus scrofa (Pig)
Description:
P15145
Residue:
963
  
Inhibitor
Name:
BDBM50206547
Synonyms:
CHEMBL374479 | N-hydroxy-2-isobutyl-N'-naphthalen-1-ylmethyl-malonamide
Type:
Small organic molecule
Emp. Form.:
C18H22N2O3
Mol. Mass.:
314.3789
SMILES:
CC(C)CC(C(=O)NO)C(=O)NCc1cccc2ccccc12
: