Target
Melanin-concentrating hormone receptor 1
Ligand
BDBM50206694
Substrate
Meas. Tech.
ChEMBL_442721 (CHEMBL892889)
Ki
46±n/a nM
Citation
 Zhang, MTamiya, JNguyen, LRowbottom, MWDyck, BVickers, TDGrey, JSchwarz, DAHeise, CEHaelewyn, JMistry, MSGoodfellow, VS Thienopyrimidinone bis-aminopyrrolidine ureas as potent melanin-concentrating hormone receptor-1 (MCH-R1) antagonists. Bioorg Med Chem Lett 17:2535-9 (2007)  
Target
Name:
Melanin-concentrating hormone receptor 1
Synonyms:
G-protein coupled receptor 24 MCH receptor 1 MCH-R1 MCHR-1 MCHR1_HUMAN Melanin-Concentrating Hormone Receptor 1 (MCH1R) Melanin-concentrating hormone receptor 1 (MCH-1) Melanin-concentrating hormone receptor 1 (MCHR-1) SLC-1 Somatostatin receptor-like protein
Type:
G Protein-Coupled Receptor (GPCR)
Mol. Mass.:
45976.27
Organism:
Homo sapiens (Human)
Description:
Membranes from CHO-K1 cells stably expressing human MCH1R were used in assays.
Residue:
422
  
Inhibitor
Name:
BDBM50206694
Synonyms:
(S)-3-(6-(4-methoxy-2-methylphenyl)-4-oxothieno[3,2-d]pyrimidin-3(4H)-yl)-N-methyl-N-((S)-1-methylpyrrolidin-3-yl)pyrrolidine-1-carboxamide | CHEMBL232027
Type:
Small organic molecule
Emp. Form.:
C25H31N5O3S
Mol. Mass.:
481.61
SMILES:
COc1ccc(-c2cc3ncn([C@H]4CCN(C4)C(=O)N(C)[C@H]4CCN(C)C4)c(=O)c3s2)c(C)c1
: