Target
Nitric oxide synthase, inducible
Ligand
BDBM50207097
Substrate
Meas. Tech.
ChEMBL_438482 (CHEMBL887582)
IC50
220±n/a nM
Citation
 Whitlow, MAdler, MDavey, DHuang, QKoovakkat, SParkinson, JFPham, EPolokoff, MXu, WYuan, SPhillips, G The rational design of inhibitors of nitric oxide formation by inducible nitric oxide synthase. Bioorg Med Chem Lett 17:2505-8 (2007)  
Target
Name:
Nitric oxide synthase, inducible
Synonyms:
HEP-NOS Inducible NO synthase NOS type II NOS2A Nitric oxide synthase, inducible (iNOS) | iNOS
Type:
Homodimer
Mol. Mass.:
131141.95
Organism:
Homo sapiens (Human)
Description:
P35228
Residue:
1153
  
Inhibitor
Name:
BDBM50207097
Synonyms:
6-(4-(1H-imidazol-1-yl)phenoxy)-2-(benzo[d][1,3]dioxol-5-ylmethyl)-N-(3-(dimethylamino)propyl)-N-methylpyrimidin-4-amine | CHEMBL244599
Type:
Small organic molecule
Emp. Form.:
C27H30N6O3
Mol. Mass.:
486.5655
SMILES:
CN(C)CCCN(C)c1cc(Oc2ccc(cc2)-n2ccnc2)nc(Cc2ccc3OCOc3c2)n1
: