Target
Alpha-glucosidase MAL12
Ligand
BDBM50207546
Substrate
Meas. Tech.
ChEMBL_429131 (CHEMBL904248)
IC50
36000±n/a nM
Citation
 Ogawa, SKanto, M Synthesis of valiolamine and some precursors for bioactive carbaglycosylamines from (-)-vibo-quercitol produced by biogenesis of myo-inositol. J Nat Prod 70:493-7 (2007)  
Target
Name:
Alpha-glucosidase MAL12
Synonyms:
α-Glucosidase MAL12_YEAST Maltase | alpha-Glucosidase (α-Glucosidase)
Type:
Protein
Mol. Mass.:
68084.32
Organism:
Saccharomyces cerevisiae
Description:
P53341
Residue:
584
  
Inhibitor
Name:
BDBM50207546
Synonyms:
(-)-epivaliolamine | CHEMBL223096
Type:
Small organic molecule
Emp. Form.:
C7H15NO5
Mol. Mass.:
193.1977
SMILES:
N[C@@H]1C[C@](O)(CO)[C@@H](O)[C@H](O)[C@H]1O
: