Target
Sodium-dependent serotonin transporter
Ligand
BDBM50207755
Substrate
Meas. Tech.
ChEMBL_443082 (CHEMBL892213)
IC50
1200±n/a nM
Citation
 Roggen, HKehler, JStensbøl, TBHansen, T Synthesis of enantiomerically pure milnacipran analogs and inhibition of dopamine, serotonin, and norepinephrine transporters. Bioorg Med Chem Lett 17:2834-7 (2007)  
Target
Name:
Sodium-dependent serotonin transporter
Synonyms:
5-HT Transporter 5HT transporter Anandamid membrane transporter, AMT Monoamine transporters; Norepinephrine & serotonin Slc6a4 Sodium-dependent serotonin transporter (SERT) | imipramine receptor
Type:
Multi-pass membrane protein
Mol. Mass.:
70168.43
Organism:
Rattus norvegicus (rat)
Description:
P31652
Residue:
630
  
Inhibitor
Name:
BDBM50207755
Synonyms:
CHEMBL233645 | [(1S,2R)-2-(diethylcarbamoyl)-2-(naphthalen-1-yl)cyclopropyl]methanaminium chloride
Type:
Small organic molecule
Emp. Form.:
C19H25N2O
Mol. Mass.:
297.4141
SMILES:
CCN(CC)C(=O)[C@@]1(C[C@@H]1C[NH3+])c1cccc2ccccc12
: