Target
Integrin alpha-V/beta-6
Ligand
BDBM50209470
Substrate
Meas. Tech.
ChEMBL_443534 (CHEMBL893791)
IC50
96±n/a nM
Citation
 Nagarajan, SRDevadas, BMalecha, JWLu, HFRuminski, PGRico, JGRogers, TEMarrufo, LDCollins, JTKleine, HPLantz, MKZhu, JGreen, NFRussell, MALandis, BHMiller, LMMeyer, DMDuffin, TDEngleman, VWFinn, MBFreeman, SKGriggs, DWWilliams, MLNickols, MAPegg, JAShannon, KESteininger, CWestlin, MMNickols, GAKeene, JL R-isomers of Arg-Gly-Asp (RGD) mimics as potent alphavbeta3 inhibitors. Bioorg Med Chem 15:3783-800 (2007)  
Target
Name:
Integrin alpha-V/beta-6
Synonyms:
ITGAV/ITGB6 Integrin alpha-v/beata-6 Integrin beta-6/Vitronectin receptor alpha
Type:
Enzyme
Mol. Mass.:
Description:
Components:
This complex has 2 components.
Component 1
Name:
Integrin alpha-V
Synonyms:
ITAV_HUMAN Integrin alpha-V/alpha-5 VNRA Vitronectin receptor | Vitronectin receptor subunit alpha
Type:
PROTEIN
Mol. Mass.:
116024.92
Organism:
Homo sapiens (Human)
Description:
ChEMBL_582336
Residue:
1048
  
Component 2
Name:
Integrin beta-6
Synonyms:
ITB6_HUMAN | ITGB6
Type:
PROTEIN
Mol. Mass.:
85919.61
Organism:
Homo sapiens (Human)
Description:
EBI_10916
Residue:
788
  
Inhibitor
Name:
BDBM50209470
Synonyms:
(3R)-3-(3,5-dibromo-2-hydroxyphenyl)-3-(2-(3-hydroxy-5-(5-hydroxy-1,4,5,6-tetrahydropyrimidin-2-ylamino)benzamido)acetamido)propanoic acid | CHEMBL244634
Type:
Small organic molecule
Emp. Form.:
C22H23Br2N5O7
Mol. Mass.:
629.255
SMILES:
[#8]-[#6]-1-[#6]-[#7]\[#6](-[#7]-[#6]-1)=[#7]\c1cc(-[#8])cc(c1)-[#6](=O)-[#7]-[#6]-[#6](=O)-[#7]-[#6@H](-[#6]-[#6](-[#8])=O)-c1cc(Br)cc(Br)c1-[#8]
: