Target
B1 bradykinin receptor
Ligand
BDBM50209731
Substrate
Meas. Tech.
ChEMBL_434360 (CHEMBL919419)
Ki
10±n/a nM
Citation
 Biswas, KLi, AChen, JJD'Amico, DCFotsch, CHan, NHuman, JLiu, QNorman, MHRiahi, BYuan, CSuzuki, HMareska, DAZhan, JClarke, DEToro, AGroneberg, RDBurgess, LELester-Zeiner, DBiddlecome, GManning, BHArik, LDong, HHuang, MKamassah, ALoeloff, RSun, HHsieh, FYKumar, GNg, GYHungate, RWAskew, BCJohnson, E Potent nonpeptide antagonists of the bradykinin B1 receptor: structure-activity relationship studies with novel diaminochroman carboxamides. J Med Chem 50:2200-12 (2007)  
Target
Name:
B1 bradykinin receptor
Synonyms:
B1 BRADYKININ B1R BK-1 receptor BRADYB1 | Bradykinin B1 receptor
Type:
Enzyme
Mol. Mass.:
40508.87
Organism:
Homo sapiens (Human)
Description:
P46663
Residue:
353
  
Inhibitor
Name:
BDBM50209731
Synonyms:
(R)-N-((R)-7-((cyclobutylamino)methyl)chroman-4-yl)-3-(4-fluorophenyl)-3-(3-(trifluoromethyl)phenylsulfonamido)-propanamide | CHEMBL227977
Type:
Small organic molecule
Emp. Form.:
C30H31F4N3O4S
Mol. Mass.:
605.643
SMILES:
Fc1ccc(cc1)[C@@H](CC(=O)N[C@@H]1CCOc2cc(CNC3CCC3)ccc12)NS(=O)(=O)c1cccc(c1)C(F)(F)F
: