Target
Sodium-dependent dopamine transporter
Ligand
BDBM50209971
Substrate
Meas. Tech.
ChEMBL_458981 (CHEMBL925075)
Ki
490±n/a nM
Citation
 Pruitt, JRBatt, DGWacker, DABostrom, LLBooker, SKMcLaughlin, EHoughton, GCVarnes, JGChrist, DDCovington, MDas, AMDavies, PGraden, DKariv, IOrlovsky, YStowell, NCVaddi, KGWadman, EAWelch, PKYeleswaram, SSolomon, KANewton, RCDecicco, CPCarter, PHKo, SS CC chemokine receptor-3 (CCR3) antagonists: improving the selectivity of DPC168 by reducing central ring lipophilicity. Bioorg Med Chem Lett 17:2992-7 (2007)  
Target
Name:
Sodium-dependent dopamine transporter
Synonyms:
DA transporter DAT1 Dopamine transporter protein (DAT) SC6A3_HUMAN Sodium-dependent dopamine transporter Solute carrier family 6 member 3
Type:
Multi-pass membrane protein
Mol. Mass.:
68497.11
Organism:
Homo sapiens (Human)
Description:
Q01959
Residue:
620
  
Inhibitor
Name:
BDBM50209971
Synonyms:
1-((1R,2S)-2-(((S)-3-(4-fluorobenzyl)piperidin-1-yl)methyl)cyclohexyl)-3-(3-acetylphenyl)urea | CHEMBL250689
Type:
Small organic molecule
Emp. Form.:
C28H36FN3O2
Mol. Mass.:
465.6027
SMILES:
CC(=O)c1cccc(NC(=O)N[C@@H]2CCCC[C@H]2CN2CCC[C@@H](Cc3ccc(F)cc3)C2)c1
: