Target
Chymase
Ligand
BDBM50210096
Substrate
Meas. Tech.
ChEMBL_455355 (CHEMBL886130)
IC50
42±n/a nM
Citation
 Tanaka, TMuto, TMaruoka, HImajo, SFukami, HTomimori, YFukuda, YNakatsuka, T Identification of 6-substituted 4-arylsulfonyl-1,4-diazepane-2,5-diones as a novel scaffold for human chymase inhibitors. Bioorg Med Chem Lett 17:3431-4 (2007)  
Target
Name:
Chymase
Synonyms:
Alpha-chymase CMA1_HUMAN CYM Mast cell protease I
Type:
Enzyme
Mol. Mass.:
27340.12
Organism:
Homo sapiens (Human)
Description:
Residue:
247
  
Inhibitor
Name:
BDBM50210096
Synonyms:
2-(4-chloro-2-((1-(4-chlorophenylsulfonyl)-3,7-dioxo-1,4-diazepan-6-yl)methyl)phenoxy)-N-methylacetamide | CHEMBL396067
Type:
Small organic molecule
Emp. Form.:
C21H21Cl2N3O6S
Mol. Mass.:
514.379
SMILES:
CNC(=O)COc1ccc(Cl)cc1CC1CNC(=O)CN(C1=O)S(=O)(=O)c1ccc(Cl)cc1
: