Target
Chymase
Ligand
BDBM50210114
Substrate
Meas. Tech.
ChEMBL_455355 (CHEMBL886130)
IC50
280±n/a nM
Citation
 Tanaka, TMuto, TMaruoka, HImajo, SFukami, HTomimori, YFukuda, YNakatsuka, T Identification of 6-substituted 4-arylsulfonyl-1,4-diazepane-2,5-diones as a novel scaffold for human chymase inhibitors. Bioorg Med Chem Lett 17:3431-4 (2007)  
Target
Name:
Chymase
Synonyms:
Alpha-chymase CMA1_HUMAN CYM Mast cell protease I
Type:
Enzyme
Mol. Mass.:
27340.12
Organism:
Homo sapiens (Human)
Description:
Residue:
247
  
Inhibitor
Name:
BDBM50210114
Synonyms:
6-(2-butoxy-5-chlorobenzyl)-4-(4-chlorophenylsulfonyl)-1,4-diazepane-2,5-dione | CHEMBL395822
Type:
Small organic molecule
Emp. Form.:
C22H24Cl2N2O5S
Mol. Mass.:
499.407
SMILES:
CCCCOc1ccc(Cl)cc1CC1CNC(=O)CN(C1=O)S(=O)(=O)c1ccc(Cl)cc1
: