Target
Alpha-1D adrenergic receptor
Ligand
BDBM50211324
Substrate
Meas. Tech.
ChEMBL_444278 (CHEMBL894518)
Ki
24±n/a nM
Citation
 Chiu, GLi, SConnolly, PJPulito, VLiu, JMiddleton, SA (Arylpiperazinyl)cyclohexylsufonamides: discovery of alpha(1a/1d)-selective adrenergic receptor antagonists for the treatment of Benign Prostatic Hyperplasia/Lower Urinary Tract Symptoms (BPH/LUTS). Bioorg Med Chem Lett 17:3292-7 (2007)  
Target
Name:
Alpha-1D adrenergic receptor
Synonyms:
ADA1D_HUMAN ADRA1D Adrenergic receptor alpha Alpha 1D-adrenoreceptor Alpha-1D adrenoceptor adrenergic Alpha1D
Type:
Enzyme Catalytic Domain
Mol. Mass.:
60485.82
Organism:
Homo sapiens (Human)
Description:
adrenergic Alpha1D ADRA1D HUMAN::P25100
Residue:
572
  
Inhibitor
Name:
BDBM50211324
Synonyms:
CHEMBL236621 | N-((1r,4r)-4-(4-(2-isopropoxyphenyl)piperazin-1-yl)cyclohexyl)-3,4-dimethoxybenzenesulfonamide
Type:
Small organic molecule
Emp. Form.:
C27H39N3O5S
Mol. Mass.:
517.681
SMILES:
COc1ccc(cc1OC)S(=O)(=O)N[C@H]1CC[C@@H](CC1)N1CCN(CC1)c1ccccc1OC(C)C
: