Target
Glutamate receptor 2
Ligand
BDBM50166288
Substrate
Meas. Tech.
ChEMBL_435003 (CHEMBL920804)
Ki
0.0039±n/a nM
Citation
 Vogensen, SBFrydenvang, KGreenwood, JRPostorino, GNielsen, BPickering, DSEbert, BBølcho, UEgebjerg, JGajhede, MKastrup, JSJohansen, TNClausen, RPKrogsgaard-Larsen, P A tetrazolyl-substituted subtype-selective AMPA receptor agonist. J Med Chem 50:2408-14 (2007)  
Target
Name:
Glutamate receptor 2
Synonyms:
GRIA2_RAT Glutamate receptor AMPA 2/4 Gria2
Type:
PROTEIN
Mol. Mass.:
98691.74
Organism:
Rattus norvegicus
Description:
ChEMBL_936441
Residue:
883
  
Inhibitor
Name:
BDBM50166288
Synonyms:
(S)-2-Amino-3-[3-hydroxy-5-(2-methyl-2H-tetrazol-5-yl)-isoxazol-4-yl]-propionic acid CHEMBL370038
Type:
Small organic molecule
Emp. Form.:
C8H10N6O4
Mol. Mass.:
254.2028
SMILES:
Cn1nnc(n1)-c1o[nH]c(=O)c1C[C@H](N)C(O)=O
: