Target
Glutamate receptor 4
Ligand
BDBM50166288
Substrate
Meas. Tech.
ChEMBL_435005 (CHEMBL920256)
Ki
0.0027±n/a nM
Citation
 Vogensen, SBFrydenvang, KGreenwood, JRPostorino, GNielsen, BPickering, DSEbert, BBølcho, UEgebjerg, JGajhede, MKastrup, JSJohansen, TNClausen, RPKrogsgaard-Larsen, P A tetrazolyl-substituted subtype-selective AMPA receptor agonist. J Med Chem 50:2408-14 (2007)  
Target
Name:
Glutamate receptor 4
Synonyms:
GRIA4_RAT Glutamate receptor ionotropic, AMPA 4 Gria4
Type:
PROTEIN
Mol. Mass.:
100766.57
Organism:
Rattus norvegicus
Description:
ChEMBL_539474
Residue:
902
  
Inhibitor
Name:
BDBM50166288
Synonyms:
(S)-2-Amino-3-[3-hydroxy-5-(2-methyl-2H-tetrazol-5-yl)-isoxazol-4-yl]-propionic acid CHEMBL370038
Type:
Small organic molecule
Emp. Form.:
C8H10N6O4
Mol. Mass.:
254.2028
SMILES:
Cn1nnc(n1)-c1o[nH]c(=O)c1C[C@H](N)C(O)=O
: