Target
Coagulation factor X
Ligand
BDBM50211551
Substrate
Meas. Tech.
ChEMBL_438714 (CHEMBL889048)
Ki
0.87±n/a nM
Citation
 Dönnecke, DSchweinitz, AStürzebecher, ASteinmetzer, PSchuster, MStürzebecher, UNicklisch, SStürzebecher, JSteinmetzer, T From selective substrate analogue factor Xa inhibitors to dual inhibitors of thrombin and factor Xa. Part 3. Bioorg Med Chem Lett 17:3322-9 (2007)  
Target
Name:
Coagulation factor X
Synonyms:
Activated coagulation factor X (FXa) Coagulation factor X precursor F10 Factor X heavy chain Factor Xa Stuart-Prower factor
Type:
Enzyme
Mol. Mass.:
54726.60
Organism:
Homo sapiens (Human)
Description:
Residue:
488
  
Inhibitor
Name:
BDBM50211551
Synonyms:
CHEMBL228285 | N-[1-[(S)-2-(2-aminomethyl-5-chloro-benzylcarbamoyl)-pyrrolidine-1-carbonyl]-3-(1-oxy-pyridin-2-yl)-propyl]-oxalamic acid methyl ester
Type:
Small organic molecule
Emp. Form.:
C25H30ClN5O6
Mol. Mass.:
531.989
SMILES:
COC(=O)C(=O)NC(CCc1cccc[n+]1[O-])C(=O)N1CCC[C@H]1C(=O)NCc1cc(Cl)ccc1CN
: