Target
Coagulation factor X
Ligand
BDBM50211567
Substrate
Meas. Tech.
ChEMBL_438714 (CHEMBL889048)
Ki
0.059±n/a nM
Citation
 Dönnecke, DSchweinitz, AStürzebecher, ASteinmetzer, PSchuster, MStürzebecher, UNicklisch, SStürzebecher, JSteinmetzer, T From selective substrate analogue factor Xa inhibitors to dual inhibitors of thrombin and factor Xa. Part 3. Bioorg Med Chem Lett 17:3322-9 (2007)  
Target
Name:
Coagulation factor X
Synonyms:
Activated coagulation factor X (FXa) Coagulation factor X precursor F10 Factor X heavy chain Factor Xa Stuart-Prower factor
Type:
Enzyme
Mol. Mass.:
54726.60
Organism:
Homo sapiens (Human)
Description:
Residue:
488
  
Inhibitor
Name:
BDBM50211567
Synonyms:
(R)-N-[(S)-1-(2-aminomethyl-5-chloro-benzylcarbamoyl)-2-hydroxy-ethyl]-4-(1-oxy-pyridin-2-yl)-2-phenylmethanesulfonylamino-butyramide | CHEMBL396058
Type:
Small organic molecule
Emp. Form.:
C27H32ClN5O6S
Mol. Mass.:
590.091
SMILES:
NCc1ccc(Cl)cc1CNC(=O)[C@H](CO)NC(=O)[C@@H](CCc1cccc[n+]1[O-])NS(=O)(=O)Cc1ccccc1
: