Target
Coagulation factor X
Ligand
BDBM50211552
Substrate
Meas. Tech.
ChEMBL_438714 (CHEMBL889048)
Ki
0.35±n/a nM
Citation
 Dönnecke, DSchweinitz, AStürzebecher, ASteinmetzer, PSchuster, MStürzebecher, UNicklisch, SStürzebecher, JSteinmetzer, T From selective substrate analogue factor Xa inhibitors to dual inhibitors of thrombin and factor Xa. Part 3. Bioorg Med Chem Lett 17:3322-9 (2007)  
Target
Name:
Coagulation factor X
Synonyms:
Activated coagulation factor X (FXa) Coagulation factor X precursor F10 Factor X heavy chain Factor Xa Stuart-Prower factor
Type:
Enzyme
Mol. Mass.:
54726.60
Organism:
Homo sapiens (Human)
Description:
Residue:
488
  
Inhibitor
Name:
BDBM50211552
Synonyms:
(4-{[1-{[(2-aminomethyl-5-chloro-benzylcarbamoyl)-methyl]-carbamoyl}-3-(1-oxy-pyridin-2-yl)-propylsulfamoyl]-methyl}-phenyl)-acetic acid methyl ester | CHEMBL442228
Type:
Small organic molecule
Emp. Form.:
C29H34ClN5O7S
Mol. Mass.:
632.128
SMILES:
COC(=O)Cc1ccc(CS(=O)(=O)NC(CCc2cccc[n+]2[O-])C(=O)NCC(=O)NCc2cc(Cl)ccc2CN)cc1
: