Target
Prostaglandin G/H synthase 2
Ligand
BDBM50213229
Substrate
Meas. Tech.
ChEMBL_436848 (CHEMBL905150)
IC50
>100000±n/a nM
Citation
 Velázquez, CAPraveen Rao, PNCitro, MLKeefer, LKKnaus, EE O2-acetoxymethyl-protected diazeniumdiolate-based NSAIDs (NONO-NSAIDs): synthesis, nitric oxide release, and biological evaluation studies. Bioorg Med Chem 15:4767-74 (2007)  
Target
Name:
Prostaglandin G/H synthase 2
Synonyms:
COX2 Cyclooxygenase-2 (COX-2) PTGS2 Prostaglandin G/H synthase (cyclooxygenase)
Type:
Protein
Mol. Mass.:
68976.98
Organism:
Ovis aries (Sheep)
Description:
Residue:
603
  
Inhibitor
Name:
BDBM50213229
Synonyms:
CHEMBL229738 | O2-acetoxymethyl 1-{N-[2-(2-(1-(4-chlorobenzoyl)-5-methoxy-2-methyl-1H-indol-3-yl)acetoxy)ethyl]-N-methylamino}diazen-1-ium-1,2-diolate
Type:
Small organic molecule
Emp. Form.:
C25H27ClN4O8
Mol. Mass.:
546.957
SMILES:
COc1ccc2n(C(=O)c3ccc(Cl)cc3)c(C)c(CC(=O)OCCN(C)[N+](\[O-])=N\OCOC(C)=O)c2c1
: