Target
Prostaglandin G/H synthase 1
Ligand
BDBM50213231
Substrate
Meas. Tech.
ChEMBL_436847 (CHEMBL905149)
IC50
>100000±n/a nM
Citation
 Velázquez, CAPraveen Rao, PNCitro, MLKeefer, LKKnaus, EE O2-acetoxymethyl-protected diazeniumdiolate-based NSAIDs (NONO-NSAIDs): synthesis, nitric oxide release, and biological evaluation studies. Bioorg Med Chem 15:4767-74 (2007)  
Target
Name:
Prostaglandin G/H synthase 1
Synonyms:
COX1 Cyclooxygenase-1 (COX-1) PTGS1 | Prostaglandin G/H synthase (cyclooxygenase)
Type:
Protein
Mol. Mass.:
68868.60
Organism:
Ovis aries (Sheep)
Description:
Residue:
600
  
Inhibitor
Name:
BDBM50213231
Synonyms:
CHEMBL387966 | O2-acetoxymethyl 1-[N-(2-(acetylsalicyloyloxy)ethyl)-N-methylamino]diazen-1-ium-1,2-diolate
Type:
Small organic molecule
Emp. Form.:
C15H19N3O8
Mol. Mass.:
369.3267
SMILES:
CN(CCOC(=O)c1ccccc1OC(C)=O)[N+](\[O-])=N\OCOC(C)=O
: