Target
Alpha-1A adrenergic receptor
Ligand
BDBM50213538
Substrate
Meas. Tech.
ChEMBL_438892 (CHEMBL889235)
Ki
1.8±n/a nM
Citation
 Chiu, GLi, SConnolly, PJPulito, VLiu, JMiddleton, SA (Phenylpiperidinyl)cyclohexylsulfonamides: development of alpha1a/1d-selective adrenergic receptor antagonists for the treatment of benign prostatic hyperplasia/lower urinary tract symptoms (BPH/LUTS). Bioorg Med Chem Lett 17:3930-4 (2007)  
Target
Name:
Alpha-1A adrenergic receptor
Synonyms:
ADA1A_HUMAN ADRA1C Alpha 1A-adrenoceptor Alpha adrenergic receptor 1a Alpha-adrenergic receptor 1c adrenergic Alpha1 | adrenergic Alpha1C
Type:
Cell-surface receptors
Mol. Mass.:
51511.67
Organism:
Homo sapiens (Human)
Description:
P35348
Residue:
466
  
Inhibitor
Name:
BDBM50213538
Synonyms:
5-chloro-N-((1s,4s)-4-(4-(2-cyclopropoxyphenyl)piperidin-1-yl)cyclohexyl)-2-fluorobenzenesulfonamide | CHEMBL228280
Type:
Small organic molecule
Emp. Form.:
C26H32ClFN2O3S
Mol. Mass.:
507.06
SMILES:
Fc1ccc(Cl)cc1S(=O)(=O)N[C@H]1CC[C@H](CC1)N1CCC(CC1)c1ccccc1OC1CC1
: