Target
Alpha-1B adrenergic receptor
Ligand
BDBM50213538
Substrate
Meas. Tech.
ChEMBL_438893 (CHEMBL889236)
Ki
107±n/a nM
Citation
 Chiu, GLi, SConnolly, PJPulito, VLiu, JMiddleton, SA (Phenylpiperidinyl)cyclohexylsulfonamides: development of alpha1a/1d-selective adrenergic receptor antagonists for the treatment of benign prostatic hyperplasia/lower urinary tract symptoms (BPH/LUTS). Bioorg Med Chem Lett 17:3930-4 (2007)  
Target
Name:
Alpha-1B adrenergic receptor
Synonyms:
ADA1B_HUMAN Adrenergic alpha1B Adrenergic receptor alpha Alpha 1B-adrenoreceptor | Alpha-1B adrenergic receptor
Type:
Enzyme
Mol. Mass.:
56862.13
Organism:
Homo sapiens (Human)
Description:
P35368
Residue:
520
  
Inhibitor
Name:
BDBM50213538
Synonyms:
5-chloro-N-((1s,4s)-4-(4-(2-cyclopropoxyphenyl)piperidin-1-yl)cyclohexyl)-2-fluorobenzenesulfonamide | CHEMBL228280
Type:
Small organic molecule
Emp. Form.:
C26H32ClFN2O3S
Mol. Mass.:
507.06
SMILES:
Fc1ccc(Cl)cc1S(=O)(=O)N[C@H]1CC[C@H](CC1)N1CCC(CC1)c1ccccc1OC1CC1
: