Target
Metabotropic glutamate receptor 1
Ligand
BDBM50214078
Substrate
Meas. Tech.
ChEMBL_456241 (CHEMBL888251)
IC50
78±n/a nM
Citation
 Wang, XKolasa, TEl Kouhen, OFChovan, LEBlack-Shaefer, CLWagenaar, FLGarton, JAMoreland, RBHonore, PLau, YYDandliker, PJBrioni, JDStewart, AO Rapid hit to lead evaluation of pyrazolo[3,4-d]pyrimidin-4-one as selective and orally bioavailable mGluR1 antagonists. Bioorg Med Chem Lett 17:4303-7 (2007)  
Target
Name:
Metabotropic glutamate receptor 1
Synonyms:
GPRC1A GRM1_HUMAN Metabotropic Glutamate 1a | metabotropic glutamate 1
Type:
Enzyme
Mol. Mass.:
132358.19
Organism:
Homo sapiens (Human)
Description:
Q13255
Residue:
1194
  
Inhibitor
Name:
BDBM50214078
Synonyms:
5-(4-bromophenyl)-6-methyl-1-phenyl-1H-pyrazolo[3,4-d]pyrimidin-4(5H)-one | CHEMBL248208
Type:
Small organic molecule
Emp. Form.:
C18H13BrN4O
Mol. Mass.:
381.226
SMILES:
Cc1nc2n(ncc2c(=O)n1-c1ccc(Br)cc1)-c1ccccc1
: