Target
Glucocorticoid receptor
Ligand
BDBM50214932
Substrate
Meas. Tech.
ChEMBL_447642 (CHEMBL896649)
Ki
0.9±n/a nM
Citation
 Ardecky, RJHudson, ARPhillips, DPTyhonas, JSDeckhut, CLau, TLLi, YMartinborough, EARoach, SLHiguchi, RILopez, FJMarschke, KBMiner, JNKaranewsky, DSNegro-Vilar, AZhi, L 5(Z)-benzylidene-1,2-dihydro-9-hydroxy-10-methoxy-2,2,4-trimethyl-5H-1-aza-6-oxa-chrysenes as non-steroidal glucocorticoid receptor modulators. Bioorg Med Chem Lett 17:4158-62 (2007)  
Target
Name:
Glucocorticoid receptor
Synonyms:
GCR_HUMAN GRL Glucocorticoid receptor (GRFP) Nuclear receptor subfamily 3 group C member 1
Type:
Enzyme
Mol. Mass.:
85656.87
Organism:
Homo sapiens (Human)
Description:
P04150
Residue:
777
  
Inhibitor
Name:
BDBM50214932
Synonyms:
(Z)-5-((6-fluoro-4H-benzo[d][1,3]dioxin-8-yl)methylene)-10-methoxy-2,2,4-trimethyl-2,4a,5,12a-tetrahydro-1H-chromeno[3,4-f]quinolin-9-ol | CHEMBL232376
Type:
Small organic molecule
Emp. Form.:
C29H28FNO5
Mol. Mass.:
489.5347
SMILES:
COc1c(O)ccc2O\C(=C/c3cc(F)cc4COCOc34)C3=C(C=CC4NC(C)(C)C=C(C)C34)c12
: