Target
P2Y purinoceptor 1
Ligand
BDBM50121987
Substrate
Meas. Tech.
ChEMBL_439403 (CHEMBL888516)
Ki
76±n/a nM
Citation
 Costanzi, STikhonova, IGOhno, MRoh, EJJoshi, BVColson, AOHouston, DMaddileti, SHarden, TKJacobson, KA P2Y1 antagonists: combining receptor-based modeling and QSAR for a quantitative prediction of the biological activity based on consensus scoring. J Med Chem 50:3229-41 (2007)  
Target
Name:
P2Y purinoceptor 1
Synonyms:
ATP receptor P2RY1_HUMAN P2Y1 Purinergic receptor P2Y1
Type:
Enzyme
Mol. Mass.:
42090.25
Organism:
Homo sapiens (Human)
Description:
P47900
Residue:
373
  
Inhibitor
Name:
BDBM50121987
Synonyms:
CHEMBL153254 | [3-(2-Chloro-6-methylamino-purin-9-yl)-2-phosphonomethyl-propyl]-phosphonic acid
Type:
Small organic molecule
Emp. Form.:
C10H16ClN5O6P2
Mol. Mass.:
399.664
SMILES:
CNc1nc(Cl)nc2n(CC(CP(O)(O)=O)CP(O)(O)=O)cnc12
: