Target
P2Y purinoceptor 1
Ligand
BDBM50215406
Substrate
Meas. Tech.
ChEMBL_439403 (CHEMBL888516)
Ki
95±n/a nM
Citation
 Costanzi, STikhonova, IGOhno, MRoh, EJJoshi, BVColson, AOHouston, DMaddileti, SHarden, TKJacobson, KA P2Y1 antagonists: combining receptor-based modeling and QSAR for a quantitative prediction of the biological activity based on consensus scoring. J Med Chem 50:3229-41 (2007)  
Target
Name:
P2Y purinoceptor 1
Synonyms:
ATP receptor P2RY1_HUMAN P2Y1 Purinergic receptor P2Y1
Type:
Enzyme
Mol. Mass.:
42090.25
Organism:
Homo sapiens (Human)
Description:
P47900
Residue:
373
  
Inhibitor
Name:
BDBM50215406
Synonyms:
(1'R,2'S,4'S,5'S)-4-(2-ethynyl-6-methylaminopurin-9-yl)-1-[(phosphato)-methyl]-2-(phosphato)-bicyclo[3.1.0]hexane | CHEMBL390149
Type:
Small organic molecule
Emp. Form.:
C15H19N5O8P2
Mol. Mass.:
459.2876
SMILES:
CNc1nc(nc2n(cnc12)[C@H]1C[C@H](OP(O)(O)=O)[C@]2(COP(O)(O)=O)C[C@H]12)C#C
: