Target
Metabotropic glutamate receptor 5
Ligand
BDBM50215449
Substrate
Meas. Tech.
ChEMBL_439547 (CHEMBL888663)
IC50
85±n/a nM
Citation
 Carroll, FIKotturi, SVNavarro, HAMascarella, SWGilmour, BPSmith, FLGabra, BHDewey, WL Synthesis and pharmacological evaluation of phenylethynyl[1,2,4]methyltriazines as analogues of 3-methyl-6-(phenylethynyl)pyridine. J Med Chem 50:3388-91 (2007)  
Target
Name:
Metabotropic glutamate receptor 5
Synonyms:
GPRC1E GRM5_HUMAN metabotropic glutamate 5 | metabotropic glutamate 5a
Type:
Enzyme
Mol. Mass.:
132484.72
Organism:
Homo sapiens (Human)
Description:
Residue:
1212
  
Inhibitor
Name:
BDBM50215449
Synonyms:
5-methyl-3-(2-(3-(trifluoromethyl)phenyl)ethynyl)-1,2,4-triazine | CHEMBL227202
Type:
Small organic molecule
Emp. Form.:
C13H8F3N3
Mol. Mass.:
263.2179
SMILES:
Cc1cnnc(n1)C#Cc1cccc(c1)C(F)(F)F
: