Target
72 kDa type IV collagenase
Ligand
BDBM50216004
Substrate
Meas. Tech.
ChEMBL_456575 (CHEMBL922941)
Ki
1598±n/a nM
Citation
 Gilmore, JLKing, BWAsakawa, NHarrison, KTebben, ASheppeck, JELiu, RQCovington, MDuan, JJ Synthesis and structure-activity relationship of a novel, non-hydroxamate series of TNF-alpha converting enzyme inhibitors. Bioorg Med Chem Lett 17:4678-82 (2007)  
Target
Name:
72 kDa type IV collagenase
Synonyms:
72 kDa gelatinase CLG4A Gelatinase A (MMP-2) MMP2_HUMAN Matrix metalloproteinase-2 (MMP 2) Matrix metalloproteinases 2 (MMP-2) | TBE-1
Type:
Enzyme
Mol. Mass.:
73870.36
Organism:
Homo sapiens (Human)
Description:
P08253
Residue:
660
  
Inhibitor
Name:
BDBM50216004
Synonyms:
4-((2-methylquinolin-4-yl)methoxy)-N-(4-((5-thioxo-4,5-dihydro-1H-1,2,4-triazol-3-yl)methyl)-tetrahydro-2H-pyran-4-yl)benzamide | CHEMBL247140
Type:
Small organic molecule
Emp. Form.:
C26H27N5O3S
Mol. Mass.:
489.589
SMILES:
Cc1cc(COc2ccc(cc2)C(=O)NC2(Cc3n[nH]c(=S)[nH]3)CCOCC2)c2ccccc2n1
: