Target
Stromelysin-1
Ligand
BDBM50215991
Substrate
Meas. Tech.
ChEMBL_456576 (CHEMBL922942)
Ki
>4501±n/a nM
Citation
 Gilmore, JLKing, BWAsakawa, NHarrison, KTebben, ASheppeck, JELiu, RQCovington, MDuan, JJ Synthesis and structure-activity relationship of a novel, non-hydroxamate series of TNF-alpha converting enzyme inhibitors. Bioorg Med Chem Lett 17:4678-82 (2007)  
Target
Name:
Stromelysin-1
Synonyms:
MMP-3 MMP3_HUMAN Matrix metalloproteinase 3 Matrix metalloproteinase-3 (MMP-3) SL-1 Stromelysin 1 | Transin-1
Type:
Enzyme
Mol. Mass.:
53973.13
Organism:
Homo sapiens (Human)
Description:
P08254
Residue:
477
  
Inhibitor
Name:
BDBM50215991
Synonyms:
4-(quinolin-4-ylmethoxy)-N-(3-(5-thioxo-4,5-dihydro-1H-1,2,4-triazol-3-yl)propyl)benzamide | CHEMBL248523
Type:
Small organic molecule
Emp. Form.:
C22H21N5O2S
Mol. Mass.:
419.499
SMILES:
O=C(NCCCc1n[nH]c(=S)[nH]1)c1ccc(OCc2ccnc3ccccc23)cc1
: