Target
72 kDa type IV collagenase
Ligand
BDBM50216005
Substrate
Meas. Tech.
ChEMBL_456575 (CHEMBL922941)
Ki
>3333±n/a nM
Citation
 Gilmore, JLKing, BWAsakawa, NHarrison, KTebben, ASheppeck, JELiu, RQCovington, MDuan, JJ Synthesis and structure-activity relationship of a novel, non-hydroxamate series of TNF-alpha converting enzyme inhibitors. Bioorg Med Chem Lett 17:4678-82 (2007)  
Target
Name:
72 kDa type IV collagenase
Synonyms:
72 kDa gelatinase CLG4A Gelatinase A (MMP-2) MMP2_HUMAN Matrix metalloproteinase-2 (MMP 2) Matrix metalloproteinases 2 (MMP-2) | TBE-1
Type:
Enzyme
Mol. Mass.:
73870.36
Organism:
Homo sapiens (Human)
Description:
P08253
Residue:
660
  
Inhibitor
Name:
BDBM50216005
Synonyms:
CHEMBL394294 | cis-4-((2-methylquinolin-4-yl)methoxy)-N-(1-propyl-4-(5-thioxo-4,5-dihydro-1H-1,2,4-triazol-3-yl)pyrrolidin-3-yl)benzamide
Type:
Small organic molecule
Emp. Form.:
C27H30N6O2S
Mol. Mass.:
502.631
SMILES:
CCCN1C[C@@H](NC(=O)c2ccc(OCc3cc(C)nc4ccccc34)cc2)[C@H](C1)c1n[nH]c(=S)[nH]1
: