Target
72 kDa type IV collagenase
Ligand
BDBM50216000
Substrate
Meas. Tech.
ChEMBL_456575 (CHEMBL922941)
Ki
>3333±n/a nM
Citation
 Gilmore, JLKing, BWAsakawa, NHarrison, KTebben, ASheppeck, JELiu, RQCovington, MDuan, JJ Synthesis and structure-activity relationship of a novel, non-hydroxamate series of TNF-alpha converting enzyme inhibitors. Bioorg Med Chem Lett 17:4678-82 (2007)  
Target
Name:
72 kDa type IV collagenase
Synonyms:
72 kDa gelatinase CLG4A Gelatinase A (MMP-2) MMP2_HUMAN Matrix metalloproteinase-2 (MMP 2) Matrix metalloproteinases 2 (MMP-2) | TBE-1
Type:
Enzyme
Mol. Mass.:
73870.36
Organism:
Homo sapiens (Human)
Description:
P08253
Residue:
660
  
Inhibitor
Name:
BDBM50216000
Synonyms:
CHEMBL247546 | cis-N-(1-acetyl-4-(5-thioxo-4,5-dihydro-1H-1,2,4-triazol-3-yl)piperidin-3-yl)-4-((2-methylquinolin-4-yl)methoxy)benzamide
Type:
Small organic molecule
Emp. Form.:
C27H28N6O3S
Mol. Mass.:
516.615
SMILES:
CC(=O)N1CC[C@@H]([C@@H](C1)NC(=O)c1ccc(OCc2cc(C)nc3ccccc23)cc1)c1n[nH]c(=S)[nH]1
: