Target
72 kDa type IV collagenase
Ligand
BDBM50216010
Substrate
Meas. Tech.
ChEMBL_456575 (CHEMBL922941)
Ki
>3333±n/a nM
Citation
 Gilmore, JLKing, BWAsakawa, NHarrison, KTebben, ASheppeck, JELiu, RQCovington, MDuan, JJ Synthesis and structure-activity relationship of a novel, non-hydroxamate series of TNF-alpha converting enzyme inhibitors. Bioorg Med Chem Lett 17:4678-82 (2007)  
Target
Name:
72 kDa type IV collagenase
Synonyms:
72 kDa gelatinase CLG4A Gelatinase A (MMP-2) MMP2_HUMAN Matrix metalloproteinase-2 (MMP 2) Matrix metalloproteinases 2 (MMP-2) | TBE-1
Type:
Enzyme
Mol. Mass.:
73870.36
Organism:
Homo sapiens (Human)
Description:
P08253
Residue:
660
  
Inhibitor
Name:
BDBM50216010
Synonyms:
(R)-3-amino-1-((R)-3-methyl-1-(5-thioxo-4,5-dihydro-1H-1,2,4-triazol-3-yl)butyl)-3-(4-((2-methylquinolin-4-yl)methoxy)phenyl)pyrrolidin-2-one | CHEMBL248148
Type:
Small organic molecule
Emp. Form.:
C28H32N6O2S
Mol. Mass.:
516.658
SMILES:
CC(C)C[C@@H](N1CC[C@](N)(C1=O)c1ccc(OCc2cc(C)nc3ccccc23)cc1)c1n[nH]c(=S)[nH]1
: