Target
Stromelysin-1
Ligand
BDBM50215990
Substrate
Meas. Tech.
ChEMBL_456576 (CHEMBL922942)
Ki
>4501±n/a nM
Citation
 Gilmore, JLKing, BWAsakawa, NHarrison, KTebben, ASheppeck, JELiu, RQCovington, MDuan, JJ Synthesis and structure-activity relationship of a novel, non-hydroxamate series of TNF-alpha converting enzyme inhibitors. Bioorg Med Chem Lett 17:4678-82 (2007)  
Target
Name:
Stromelysin-1
Synonyms:
MMP-3 MMP3_HUMAN Matrix metalloproteinase 3 Matrix metalloproteinase-3 (MMP-3) SL-1 Stromelysin 1 | Transin-1
Type:
Enzyme
Mol. Mass.:
53973.13
Organism:
Homo sapiens (Human)
Description:
P08254
Residue:
477
  
Inhibitor
Name:
BDBM50215990
Synonyms:
4-((2-methylquinolin-4-yl)methoxy)-N-((5-thioxo-4,5-dihydro-1H-1,2,4-triazol-3-yl)methyl)benzamide | CHEMBL391388
Type:
Small organic molecule
Emp. Form.:
C21H19N5O2S
Mol. Mass.:
405.473
SMILES:
Cc1cc(COc2ccc(cc2)C(=O)NCc2n[nH]c(=S)[nH]2)c2ccccc2n1
: