Target
72 kDa type IV collagenase
Ligand
BDBM50215991
Substrate
Meas. Tech.
ChEMBL_456575 (CHEMBL922941)
Ki
>3333±n/a nM
Citation
 Gilmore, JLKing, BWAsakawa, NHarrison, KTebben, ASheppeck, JELiu, RQCovington, MDuan, JJ Synthesis and structure-activity relationship of a novel, non-hydroxamate series of TNF-alpha converting enzyme inhibitors. Bioorg Med Chem Lett 17:4678-82 (2007)  
Target
Name:
72 kDa type IV collagenase
Synonyms:
72 kDa gelatinase CLG4A Gelatinase A (MMP-2) MMP2_HUMAN Matrix metalloproteinase-2 (MMP 2) Matrix metalloproteinases 2 (MMP-2) | TBE-1
Type:
Enzyme
Mol. Mass.:
73870.36
Organism:
Homo sapiens (Human)
Description:
P08253
Residue:
660
  
Inhibitor
Name:
BDBM50215991
Synonyms:
4-(quinolin-4-ylmethoxy)-N-(3-(5-thioxo-4,5-dihydro-1H-1,2,4-triazol-3-yl)propyl)benzamide | CHEMBL248523
Type:
Small organic molecule
Emp. Form.:
C22H21N5O2S
Mol. Mass.:
419.499
SMILES:
O=C(NCCCc1n[nH]c(=S)[nH]1)c1ccc(OCc2ccnc3ccccc23)cc1
: