Target
Membrane-bound transcription factor site-1 protease
Ligand
BDBM50216191
Substrate
Meas. Tech.
ChEMBL_447771 (CHEMBL896780)
IC50
430±n/a nM
Citation
 Hay, BAAbrams, BZumbrunn, AYValentine, JJWarren, LCPetras, SFShelly, LDXia, AVarghese, AHHawkins, JLVan Camp, JARobbins, MDLandschulz, KHarwood, HJ Aminopyrrolidineamide inhibitors of site-1 protease. Bioorg Med Chem Lett 17:4411-4 (2007)  
Target
Name:
Membrane-bound transcription factor site-1 protease
Synonyms:
KIAA0091 MBTPS1 SKI1
Type:
PROTEIN
Mol. Mass.:
117773.36
Organism:
Homo sapiens (Human)
Description:
ChEMBL_641529
Residue:
1052
  
Inhibitor
Name:
BDBM50216191
Synonyms:
CHEMBL232587 | N-(2,6-dichlorophenethyl)-4-((diethylamino)methyl)-N-(pyrrolidin-3-yl)benzamide
Type:
Small organic molecule
Emp. Form.:
C24H31Cl2N3O
Mol. Mass.:
448.428
SMILES:
CCN(CC)Cc1ccc(cc1)C(=O)N(CCc1c(Cl)cccc1Cl)C1CCNC1
: