Target
11-beta-hydroxysteroid dehydrogenase 1
Ligand
BDBM50216914
Substrate
Meas. Tech.
ChEMBL_448531 (CHEMBL897680)
IC50
61±n/a nM
Citation
 Sutin, LAndersson, SBergquist, LCastro, VMDanielsson, EJames, SHenriksson, MJohansson, LKaiser, CFlyrén, KWilliams, M Oxazolones as potent inhibitors of 11beta-hydroxysteroid dehydrogenase type 1. Bioorg Med Chem Lett 17:4837-40 (2007)  
Target
Name:
11-beta-hydroxysteroid dehydrogenase 1
Synonyms:
11-DH 11-beta-Hydroxysteroid Dehydrogenase 1 (11-beta-HSD1) 11-beta-hydroxysteroid dehydrogenase 1 (11HSD1) Corticosteroid 11-beta-dehydrogenase isozyme 1 (11-beta-HSD-1) Corticosteroid 11-beta-dehydrogenase isozyme 1 (11beta-HSD1) HSD11 HSD11L | SDR26C1
Type:
Enzyme
Mol. Mass.:
32409.16
Organism:
Homo sapiens (Human)
Description:
P28845
Residue:
292
  
Inhibitor
Name:
BDBM50216914
Synonyms:
2-(cyclooctylamino)-5-isopropyl-5-methyloxazol-4(5H)-one | CHEMBL237797
Type:
Small organic molecule
Emp. Form.:
C15H26N2O2
Mol. Mass.:
266.3791
SMILES:
CC(C)C1(C)OC(NC2CCCCCCC2)=NC1=O
: