Target
Melanocortin receptor 3
Ligand
BDBM50217658
Substrate
Meas. Tech.
ChEMBL_448691 (CHEMBL896691)
Ki
1700±n/a nM
Citation
 Mutulis, FKreicberga, JYahorava, SMutule, IBorisova-Jan, LYahorau, AMuceniece, RAzena, SVeiksina, SPetrovska, RWikberg, JE Design and synthesis of a library of tertiary amides: evaluation as mimetics of the melanocortins' active core. Bioorg Med Chem 15:5787-810 (2007)  
Target
Name:
Melanocortin receptor 3
Synonyms:
MC3-R MC3R_HUMAN Melanocortin receptor (M3 and M4)
Type:
Enzyme
Mol. Mass.:
36044.86
Organism:
Homo sapiens (Human)
Description:
P41968
Residue:
323
  
Inhibitor
Name:
BDBM50217658
Synonyms:
(R)-2-amino-N-(2-amino-ethyl)-3-(4-chloro-phenyl)-N-spiro[5.5]undec-3-yl-propionamide | CHEMBL237094
Type:
Small organic molecule
Emp. Form.:
C22H34ClN3O
Mol. Mass.:
391.978
SMILES:
NCCN(C1CCC2(CCCCC2)CC1)C(=O)[C@H](N)Cc1ccc(Cl)cc1
: