Target
Melanocyte-stimulating hormone receptor
Ligand
BDBM50217678
Substrate
Meas. Tech.
ChEMBL_448689 (CHEMBL896689)
Ki
810±n/a nM
Citation
 Mutulis, FKreicberga, JYahorava, SMutule, IBorisova-Jan, LYahorau, AMuceniece, RAzena, SVeiksina, SPetrovska, RWikberg, JE Design and synthesis of a library of tertiary amides: evaluation as mimetics of the melanocortins' active core. Bioorg Med Chem 15:5787-810 (2007)  
Target
Name:
Melanocyte-stimulating hormone receptor
Synonyms:
MC1-R Mc1r Melanocyte-stimulating hormone receptor | Msh-r
Type:
PROTEIN
Mol. Mass.:
35238.60
Organism:
Mus musculus
Description:
ChEMBL_1498846
Residue:
315
  
Inhibitor
Name:
BDBM50217678
Synonyms:
CHEMBL235582 | N-(4-((4-aminocyclohexyl)methyl)cyclohexyl)-N-(2-bromoallyl)-4-(1H-indol-3-yl)butanamide
Type:
Small organic molecule
Emp. Form.:
C28H40BrN3O
Mol. Mass.:
514.541
SMILES:
NC1CCC(CC2CCC(CC2)N(CC(Br)=C)C(=O)CCCc2c[nH]c3ccccc23)CC1
: