Target
Kappa-type opioid receptor
Ligand
BDBM50217953
Substrate
Meas. Tech.
ChEMBL_444758 (CHEMBL895005)
Ki
15±n/a nM
Citation
 Hiebel, ACLee, YSBilsky, EGiuvelis, DDeschamps, JRParrish, DAAceto, MDMay, ELHarris, LSCoop, ADersch, CMPartilla, JSRothman, RBCheng, KJacobson, AERice, KC Probes for narcotic receptor mediated phenomena. 34. Synthesis and structure-activity relationships of a potent mu-agonist delta-antagonist and an exceedingly potent antinociceptive in the enantiomeric C9-substituted 5-(3-hydroxyphenyl)-N-phenylethylmorphan series. J Med Chem 50:3765-76 (2007)  
Target
Name:
Kappa-type opioid receptor
Synonyms:
K-OR-1 Kappa-opioid receptor (KOR) Kappa-type opioid receptor (KOR) OPIATE Kappa OPRK1 kappa opioid receptor (KOR)
Type:
G Protein-Coupled Receptor (GPCR)
Mol. Mass.:
42648.76
Organism:
Homo sapiens (Human)
Description:
P41145
Residue:
380
  
Inhibitor
Name:
BDBM50217953
Synonyms:
(1S,5R,9S)-(-)-5-(3-hydroxyphenyl)-9-methyl-2-phenethyl-2-azabicyclo[3.3.1]nonane | CHEMBL414889
Type:
Small organic molecule
Emp. Form.:
C23H29NO
Mol. Mass.:
335.4825
SMILES:
C[C@@H]1[C@@H]2CCC[C@]1(CCN2CCc1ccccc1)c1cccc(O)c1
: