Target
Coagulation factor X
Ligand
BDBM50218281
Substrate
Meas. Tech.
ChEMBL_448736 (CHEMBL897883)
Ki
1.7±n/a nM
Citation
 Qiao, JXWang, TCWang, GZCheney, DLHe, KRendina, ARXin, BLuettgen, JMKnabb, RMWexler, RRLam, PY Enantiopure five-membered cyclicdiamine derivatives as potent and selective inhibitors of factor Xa. Improving in vitro metabolic stability via core modifications. Bioorg Med Chem Lett 17:5041-8 (2007)  
Target
Name:
Coagulation factor X
Synonyms:
Activated coagulation factor X (FXa) Coagulation factor X precursor F10 Factor X heavy chain Factor Xa Stuart-Prower factor
Type:
Enzyme
Mol. Mass.:
54726.60
Organism:
Homo sapiens (Human)
Description:
Residue:
488
  
Inhibitor
Name:
BDBM50218281
Synonyms:
5-chloro-N-((3R,4S)-4-(4-(2-oxopyridin-1(2H)-yl)benzamido)-1-pivaloylpyrrolidin-3-yl)thiophene-2-carboxamide | CHEMBL238356
Type:
Small organic molecule
Emp. Form.:
C26H27ClN4O4S
Mol. Mass.:
527.035
SMILES:
CC(C)(C)C(=O)N1C[C@@H](NC(=O)c2ccc(Cl)s2)[C@H](C1)NC(=O)c1ccc(cc1)-n1ccccc1=O
: