Target
Coagulation factor X
Ligand
BDBM50218284
Substrate
Meas. Tech.
ChEMBL_448736 (CHEMBL897883)
Ki
1.6±n/a nM
Citation
 Qiao, JXWang, TCWang, GZCheney, DLHe, KRendina, ARXin, BLuettgen, JMKnabb, RMWexler, RRLam, PY Enantiopure five-membered cyclicdiamine derivatives as potent and selective inhibitors of factor Xa. Improving in vitro metabolic stability via core modifications. Bioorg Med Chem Lett 17:5041-8 (2007)  
Target
Name:
Coagulation factor X
Synonyms:
Activated coagulation factor X (FXa) Coagulation factor X precursor F10 Factor X heavy chain Factor Xa Stuart-Prower factor
Type:
Enzyme
Mol. Mass.:
54726.60
Organism:
Homo sapiens (Human)
Description:
Residue:
488
  
Inhibitor
Name:
BDBM50218284
Synonyms:
5-chloro-N-((1R,2S,4S)-4-(cyclopropylcarbamoyl)-2-(4-(2-oxopyridin-1(2H)-yl)benzamido)cyclopentyl)thiophene-2-carboxamide | CHEMBL401444
Type:
Small organic molecule
Emp. Form.:
C26H25ClN4O4S
Mol. Mass.:
525.019
SMILES:
Clc1ccc(s1)C(=O)N[C@@H]1C[C@H](C[C@@H]1NC(=O)c1ccc(cc1)-n1ccccc1=O)C(=O)NC1CC1
: