Target
Coagulation factor X
Ligand
BDBM50218292
Substrate
Meas. Tech.
ChEMBL_448736 (CHEMBL897883)
Ki
3.9±n/a nM
Citation
 Qiao, JXWang, TCWang, GZCheney, DLHe, KRendina, ARXin, BLuettgen, JMKnabb, RMWexler, RRLam, PY Enantiopure five-membered cyclicdiamine derivatives as potent and selective inhibitors of factor Xa. Improving in vitro metabolic stability via core modifications. Bioorg Med Chem Lett 17:5041-8 (2007)  
Target
Name:
Coagulation factor X
Synonyms:
Activated coagulation factor X (FXa) Coagulation factor X precursor F10 Factor X heavy chain Factor Xa Stuart-Prower factor
Type:
Enzyme
Mol. Mass.:
54726.60
Organism:
Homo sapiens (Human)
Description:
Residue:
488
  
Inhibitor
Name:
BDBM50218292
Synonyms:
CHEMBL237924 | N-((3R,4S)-1-acetyl-4-(4-(2-oxopyridin-1(2H)-yl)benzamido)pyrrolidin-3-yl)-3-chloro-1H-indole-6-carboxamide
Type:
Small organic molecule
Emp. Form.:
C27H24ClN5O4
Mol. Mass.:
517.964
SMILES:
CC(=O)N1C[C@H](NC(=O)c2ccc(cc2)-n2ccccc2=O)[C@@H](C1)NC(=O)c1ccc2c(Cl)c[nH]c2c1
: