Target
Coagulation factor X
Ligand
BDBM50218301
Substrate
Meas. Tech.
ChEMBL_448736 (CHEMBL897883)
Ki
1±n/a nM
Citation
 Qiao, JXWang, TCWang, GZCheney, DLHe, KRendina, ARXin, BLuettgen, JMKnabb, RMWexler, RRLam, PY Enantiopure five-membered cyclicdiamine derivatives as potent and selective inhibitors of factor Xa. Improving in vitro metabolic stability via core modifications. Bioorg Med Chem Lett 17:5041-8 (2007)  
Target
Name:
Coagulation factor X
Synonyms:
Activated coagulation factor X (FXa) Coagulation factor X precursor F10 Factor X heavy chain Factor Xa Stuart-Prower factor
Type:
Enzyme
Mol. Mass.:
54726.60
Organism:
Homo sapiens (Human)
Description:
Residue:
488
  
Inhibitor
Name:
BDBM50218301
Synonyms:
3-chloro-N-((1S,2R)-1-(4-(2-oxopyridin-1(2H)-yl)benzamido)-2,3-dihydro-1H-inden-2-yl)-1H-indole-6-carboxamide | CHEMBL236643
Type:
Small organic molecule
Emp. Form.:
C30H23ClN4O3
Mol. Mass.:
522.982
SMILES:
Clc1c[nH]c2cc(ccc12)C(=O)N[C@@H]1Cc2ccccc2[C@@H]1NC(=O)c1ccc(cc1)-n1ccccc1=O
: