Target
Prothrombin
Ligand
BDBM50218291
Substrate
Meas. Tech.
ChEMBL_448744 (CHEMBL897892)
Ki
5440±n/a nM
Citation
 Qiao, JXWang, TCWang, GZCheney, DLHe, KRendina, ARXin, BLuettgen, JMKnabb, RMWexler, RRLam, PY Enantiopure five-membered cyclicdiamine derivatives as potent and selective inhibitors of factor Xa. Improving in vitro metabolic stability via core modifications. Bioorg Med Chem Lett 17:5041-8 (2007)  
Target
Name:
Prothrombin
Synonyms:
Activation peptide fragment 1 Coagulation factor II Prothrombin precursor Thrombin heavy chain | Thrombin light chain
Type:
Protein
Mol. Mass.:
70029.57
Organism:
Homo sapiens (Human)
Description:
P00734
Residue:
622
  
Inhibitor
Name:
BDBM50218291
Synonyms:
CHEMBL394129 | N-((3R,4S)-1-acetyl-4-(4-(2-oxopyridin-1(2H)-yl)benzamido)pyrrolidin-3-yl)-5-chlorothiophene-2-carboxamide
Type:
Small organic molecule
Emp. Form.:
C23H21ClN4O4S
Mol. Mass.:
484.955
SMILES:
CC(=O)N1C[C@@H](NC(=O)c2ccc(Cl)s2)[C@H](C1)NC(=O)c1ccc(cc1)-n1ccccc1=O
: