Target
Coagulation factor X
Ligand
BDBM50218309
Substrate
Meas. Tech.
ChEMBL_448736 (CHEMBL897883)
Ki
163±n/a nM
Citation
 Qiao, JXWang, TCWang, GZCheney, DLHe, KRendina, ARXin, BLuettgen, JMKnabb, RMWexler, RRLam, PY Enantiopure five-membered cyclicdiamine derivatives as potent and selective inhibitors of factor Xa. Improving in vitro metabolic stability via core modifications. Bioorg Med Chem Lett 17:5041-8 (2007)  
Target
Name:
Coagulation factor X
Synonyms:
Activated coagulation factor X (FXa) Coagulation factor X precursor F10 Factor X heavy chain Factor Xa Stuart-Prower factor
Type:
Enzyme
Mol. Mass.:
54726.60
Organism:
Homo sapiens (Human)
Description:
Residue:
488
  
Inhibitor
Name:
BDBM50218309
Synonyms:
(3R,4S)-(9H-fluoren-9-yl)methyl 3-(3-chloro-1H-indole-6-carboxamido)-4-(4-(2-oxopyridin-1(2H)-yl)benzamido)pyrrolidine-1-carboxylate | CHEMBL392006
Type:
Small organic molecule
Emp. Form.:
C40H32ClN5O5
Mol. Mass.:
698.166
SMILES:
Clc1c[nH]c2cc(ccc12)C(=O)N[C@@H]1CN(C[C@@H]1NC(=O)c1ccc(cc1)-n1ccccc1=O)C(=O)OCC1c2ccccc2-c2ccccc12
: