Target
Plasma kallikrein
Ligand
BDBM50218287
Substrate
Meas. Tech.
ChEMBL_448742 (CHEMBL897890)
Ki
>6000±n/a nM
Citation
 Qiao, JXWang, TCWang, GZCheney, DLHe, KRendina, ARXin, BLuettgen, JMKnabb, RMWexler, RRLam, PY Enantiopure five-membered cyclicdiamine derivatives as potent and selective inhibitors of factor Xa. Improving in vitro metabolic stability via core modifications. Bioorg Med Chem Lett 17:5041-8 (2007)  
Target
Name:
Plasma kallikrein
Synonyms:
Fletcher factor KLKB1 Kallikrein Plasma kallikrein heavy chain Plasma prekallikrein
Type:
Protein
Mol. Mass.:
71391.16
Organism:
Homo sapiens (Human)
Description:
P03952
Residue:
638
  
Inhibitor
Name:
BDBM50218287
Synonyms:
(1S,3R,4S)-3-(2-chlorothiophene-5-carboxamido)-4-(4-(2-oxopyridin-1(2H)-yl)benzamido)cyclopentanecarboxylic acid | CHEMBL401235
Type:
Small organic molecule
Emp. Form.:
C23H20ClN3O5S
Mol. Mass.:
485.94
SMILES:
OC(=O)[C@@H]1C[C@@H](NC(=O)c2ccc(Cl)s2)[C@H](C1)NC(=O)c1ccc(cc1)-n1ccccc1=O
: