Target
Melanin-concentrating hormone receptor 1
Ligand
BDBM50219035
Substrate
Meas. Tech.
ChEMBL_445279 (CHEMBL893404)
Ki
1.8±n/a nM
Citation
 Jiang, YChen, CALu, KDaniewska, IDe Leon, JKong, RForray, CLi, BHegde, LGWolinsky, TDCraig, DAWetzel, JMAndersen, KMarzabadi, MR Synthesis and SAR investigations for novel melanin-concentrating hormone 1 receptor (MCH1) antagonists Part 1. The discovery of arylacetamides as viable replacements for the dihydropyrimidinone moiety of an HTS hit. J Med Chem 50:3870-82 (2007)  
Target
Name:
Melanin-concentrating hormone receptor 1
Synonyms:
G-protein coupled receptor 24 MCH receptor 1 MCH-R1 MCHR MCHR1_RAT Melanin Concentrating Hormone 1 Melanin-concentrating hormone receptor 1 Slc1 | Somatostatin receptor-like protein
Type:
Enzyme Catalytic Domain
Mol. Mass.:
39075.64
Organism:
RAT
Description:
Melanin Concentrating Hormone 1 GPR24 RAT::P97639
Residue:
353
  
Inhibitor
Name:
BDBM50219035
Synonyms:
CHEMBL243355 SNAP-102739
Type:
Small organic molecule
Emp. Form.:
C32H35F4N3O2
Mol. Mass.:
569.6328
SMILES:
CC(C)C(=O)Nc1cc(C2CCN(CCCNC(=O)C(c3ccc(F)cc3)c3ccc(F)cc3)CC2)c(F)cc1F
: