Target
Kappa-type opioid receptor
Ligand
BDBM50219921
Substrate
Meas. Tech.
ChEMBL_449058 (CHEMBL899316)
Ki
1.2±n/a nM
Citation
 Takeuchi, KHolloway, WGMcKinzie, JHSuter, TMStatnick, MASurface, PLEmmerson, PJThomas, EMSiegel, MGMatt, JEWolfe, CNMitch, CH Structure-activity relationship studies of carboxamido-biaryl ethers as opioid receptor antagonists (OpRAs). Part 1. Bioorg Med Chem Lett 17:5349-52 (2007)  
Target
Name:
Kappa-type opioid receptor
Synonyms:
K-OR-1 Kappa-opioid receptor (KOR) Kappa-type opioid receptor (KOR) OPIATE Kappa OPRK1 kappa opioid receptor (KOR)
Type:
G Protein-Coupled Receptor (GPCR)
Mol. Mass.:
42648.76
Organism:
Homo sapiens (Human)
Description:
P41145
Residue:
380
  
Inhibitor
Name:
BDBM50219921
Synonyms:
4-(4-((phenethylamino)methyl)phenoxy)benzamide | CHEMBL238317
Type:
Small organic molecule
Emp. Form.:
C22H22N2O2
Mol. Mass.:
346.4223
SMILES:
NC(=O)c1ccc(Oc2ccc(CNCCc3ccccc3)cc2)cc1
: