Target
Amine oxidase [flavin-containing] A
Ligand
BDBM50220025
Substrate
Meas. Tech.
ChEMBL_445968 (CHEMBL896267)
Ki
>178000±n/a nM
Citation
 Reck, FZhou, FEyermann, CJKern, GCarcanague, DIoannidis, GIllingworth, RPoon, GGravestock, MB Novel substituted (pyridin-3-yl)phenyloxazolidinones: antibacterial agents with reduced activity against monoamine oxidase A and increased solubility. J Med Chem 50:4868-81 (2007)  
Target
Name:
Amine oxidase [flavin-containing] A
Synonyms:
AOFA_HUMAN MAO-A Monoamine oxidase Monoamine oxidase type A (MAO A) Monoamine oxidase type A (MAOA)
Type:
Protein
Mol. Mass.:
59689.53
Organism:
Homo sapiens (Human)
Description:
P21397
Residue:
527
  
Inhibitor
Name:
BDBM50220025
Synonyms:
(5R)-3-(4-{6-[2-(dimethylamino)-1-hydroxyethyl]pyridin-3-yl}-3-fluorophenyl)-5-(1H-1,2,3-triazol-1-ylmethyl)-1,3-oxazolidin-2-one | CHEMBL230863
Type:
Small organic molecule
Emp. Form.:
C21H23FN6O3
Mol. Mass.:
426.4441
SMILES:
CN(C)CC(O)c1ccc(cn1)-c1ccc(cc1F)N1C[C@H](Cn2ccnn2)OC1=O
: